Target
Amine oxidase [flavin-containing] B
Ligand
BDBM50422872
Substrate
Meas. Tech.
ChEMBL_381433 (CHEMBL867938)
IC50
71±n/a nM
Citation
 Catto, MNicolotti, OLeonetti, FCarotti, AFavia, ADSoto-Otero, RMéndez-Alvarez, ECarotti, A Structural insights into monoamine oxidase inhibitory potency and selectivity of 7-substituted coumarins from ligand- and target-based approaches. J Med Chem 49:4912-25 (2006)  
Target
Name:
Amine oxidase [flavin-containing] B
Synonyms:
AOFB_RAT Amine oxidase [flavin-containing] B Monoamine Oxidase Type B (MAO-B) Monoamine oxidase B (MAO-B) Monoamine oxidase type B (MAOB) | Monoamine oxidase-B (MAO-B)
Type:
Enzyme
Mol. Mass.:
58469.65
Organism:
Rattus norvegicus (rat)
Description:
P19643
Residue:
520
  
Inhibitor
Name:
BDBM50422872
Synonyms:
CHEMBL213285
Type:
Small organic molecule
Emp. Form.:
C19H18O4
Mol. Mass.:
310.3438
SMILES:
Cc1c(C)c(=O)oc2cc(OC[C@@H](O)c3ccccc3)ccc12
: