Target
Amine oxidase [flavin-containing] A
Ligand
BDBM50422880
Substrate
Meas. Tech.
ChEMBL_381432 (CHEMBL867937)
IC50
18621±n/a nM
Citation
 Catto, MNicolotti, OLeonetti, FCarotti, AFavia, ADSoto-Otero, RMéndez-Alvarez, ECarotti, A Structural insights into monoamine oxidase inhibitory potency and selectivity of 7-substituted coumarins from ligand- and target-based approaches. J Med Chem 49:4912-25 (2006)  
Target
Name:
Amine oxidase [flavin-containing] A
Synonyms:
AOFA_RAT Amine oxidase [flavin-containing] A Monoamine Oxidase Type A (MAO-A) Monoamine oxidase A (MAO-A) Monoamine oxidase type A (MAOA)
Type:
Enzyme
Mol. Mass.:
59515.21
Organism:
Rattus norvegicus (rat)
Description:
Residue:
526
  
Inhibitor
Name:
BDBM50422880
Synonyms:
CHEMBL211248
Type:
Small organic molecule
Emp. Form.:
C18H16O4S
Mol. Mass.:
328.382
SMILES:
Cc1c(C)c(=O)oc2cc(ccc12)S(=O)(=O)Cc1ccccc1
: