Target
Carbonic anhydrase 2
Ligand
BDBM50423788
Substrate
Meas. Tech.
ChEMBL_698609 (CHEMBL1647882)
Ki
0.005±n/a nM
Citation
 Munei, YShimamoto, KHarada, MYoshida, TChuman, H Correlation analyses on binding affinity of substituted benzenesulfonamides with carbonic anhydrase using ab initio MO calculations on their complex structures (II). Bioorg Med Chem Lett 21:141-4 (2010)  
Target
Name:
Carbonic anhydrase 2
Synonyms:
CA-II CAC Carbonate dehydratase II Carbonic anhydrase 2 (CA-II) Carbonic anhydrase C Carbonic anhydrase II (CA-II) Carbonic anhydrase II (hCA II) | Carbonic anhydrase isoenzyme II (hCA II)
Type:
Enzyme
Mol. Mass.:
29250.71
Organism:
Homo sapiens (Human)
Description:
P00918
Residue:
260
  
Inhibitor
Name:
BDBM50423788
Synonyms:
4-Butyl-Benzenesulfonamide CHEMBL150043
Type:
Small organic molecule
Emp. Form.:
C10H15NO2S
Mol. Mass.:
213.297
SMILES:
CCCCc1ccc(cc1)S(N)(=O)=O
: