Target
C-C chemokine receptor type 2
Ligand
BDBM50424003
Substrate
Meas. Tech.
ChEMBL_935891 (CHEMBL2318189)
IC50
20±n/a nM
Citation
 Cai, CKang, FAHou, CO'Neill, JCOpas, EMcKenney, SJohnson, DSui, Z Novel 2-aminooctahydrocyclopentalene-3a-carboxamides as potent CCR2 antagonists. Bioorg Med Chem Lett 23:351-4 (2012)  
Target
Name:
C-C chemokine receptor type 2
Synonyms:
C-C chemokine receptor type 2 (CCR2) CCR2_HUMAN Chemoattractant Cytokine Receptor 2 (CCR2) Monocyte chemotactic protein-1 (MCP-1)
Type:
Enzyme
Mol. Mass.:
41932.32
Organism:
Homo sapiens (Human)
Description:
P41597
Residue:
374
  
Inhibitor
Name:
BDBM50424003
Synonyms:
CHEMBL2313772
Type:
Small organic molecule
Emp. Form.:
C24H31ClF3N3O3
Mol. Mass.:
501.969
SMILES:
COC1COCCC1N[C@@H]1C[C@H]2C[C@H](Cl)C[C@]2(C1)C(=O)N1CCc2ncc(cc2C1)C(F)(F)F
: