Target
Tissue factor
Ligand
BDBM50424065
Substrate
Meas. Tech.
ChEMBL_936735 (CHEMBL2319887)
IC50
202±n/a nM
Citation
 Ge, HXZhang, JChen, LKou, JPYu, BY Chemical and microbial semi-synthesis of tetrahydroprotoberberines as inhibitors on tissue factor procoagulant activity. Bioorg Med Chem 21:62-9 (2012)  
Target
Name:
Tissue factor
Synonyms:
CD_antigen=CD142 Coagulation factor VII/tissue factor TF Thromboplastin | Tissue factor
Type:
PROTEIN
Mol. Mass.:
33067.61
Organism:
Homo sapiens (Human)
Description:
ChEMBL_936735
Residue:
295
  
Inhibitor
Name:
BDBM50424065
Synonyms:
CHEMBL2314740
Type:
Small organic molecule
Emp. Form.:
C31H29NO8
Mol. Mass.:
543.5639
SMILES:
COc1ccc2CC3N(CCc4cc5OCOc5cc34)Cc2c1OC(=O)\C=C\c1ccc(OC(C)=O)c(OC)c1
: