Target
Tissue factor
Ligand
BDBM50170666
Substrate
Meas. Tech.
ChEMBL_936735 (CHEMBL2319887)
IC50
15±n/a nM
Citation
 Ge, HXZhang, JChen, LKou, JPYu, BY Chemical and microbial semi-synthesis of tetrahydroprotoberberines as inhibitors on tissue factor procoagulant activity. Bioorg Med Chem 21:62-9 (2012)  
Target
Name:
Tissue factor
Synonyms:
CD_antigen=CD142 Coagulation factor VII/tissue factor TF Thromboplastin | Tissue factor
Type:
PROTEIN
Mol. Mass.:
33067.61
Organism:
Homo sapiens (Human)
Description:
ChEMBL_936735
Residue:
295
  
Inhibitor
Name:
BDBM50170666
Synonyms:
2,3,9,10-Tetramethoxy-5,8,13,13a-tetrahydro-6H-isoquino[3,2-a]isoquinoline | CHEMBL187892
Type:
Small organic molecule
Emp. Form.:
C21H25NO4
Mol. Mass.:
355.4275
SMILES:
COc1cc2CCN3Cc4c(CC3c2cc1OC)ccc(OC)c4OC
: