Target
Prostaglandin G/H synthase 2
Ligand
BDBM50424099
Substrate
Meas. Tech.
ChEMBL_937010 (CHEMBL2317149)
IC50
7200±n/a nM
Citation
 Bhardwaj, AKaur, JSharma, SKHuang, ZWuest, FKnaus, EE Hybrid fluorescent conjugates of COX-2 inhibitors: search for a COX-2 isozyme imaging cancer biomarker. Bioorg Med Chem Lett 23:163-8 (2012)  
Target
Name:
Prostaglandin G/H synthase 2
Synonyms:
COX2 Cyclooxygenase 2 (COX-2) Cyclooxygenase-2 (COX-2 AA) Cyclooxygenase-2 (COX-2) PGH2_HUMAN PHS II Prostaglandin E synthase/G/H synthase 2 Prostaglandin-endoperoxide synthase 2
Type:
Enzyme
Mol. Mass.:
69003.89
Organism:
Homo sapiens (Human)
Description:
Recombinant Cox-2 provided by Cayman (Cayman Chemical Co.,Ann Arbor, MI).
Residue:
604
  
Inhibitor
Name:
BDBM50424099
Synonyms:
CHEMBL2315325
Type:
Small organic molecule
Emp. Form.:
C30H28ClN3O6S2
Mol. Mass.:
626.143
SMILES:
CN(C)c1cccc2c(cccc12)S(=O)(=O)NCCNS(=O)(=O)c1ccc(cc1)C1=C(C(=O)OC1)c1ccc(Cl)cc1
: