Target
Prostaglandin G/H synthase 1
Ligand
BDBM50424101
Substrate
Meas. Tech.
ChEMBL_937009 (CHEMBL2317148)
IC50
18000±n/a nM
Citation
 Bhardwaj, AKaur, JSharma, SKHuang, ZWuest, FKnaus, EE Hybrid fluorescent conjugates of COX-2 inhibitors: search for a COX-2 isozyme imaging cancer biomarker. Bioorg Med Chem Lett 23:163-8 (2012)  
Target
Name:
Prostaglandin G/H synthase 1
Synonyms:
COX1 Cyclooxygenase-1 (COX-1) PTGS1 | Prostaglandin G/H synthase (cyclooxygenase)
Type:
Protein
Mol. Mass.:
68868.60
Organism:
Ovis aries (Sheep)
Description:
Residue:
600
  
Inhibitor
Name:
BDBM50424101
Synonyms:
CHEMBL2315019
Type:
Small organic molecule
Emp. Form.:
C27H21NO3
Mol. Mass.:
407.4605
SMILES:
COc1ccc2cc(ccc2c1)[C@H](C)C(=O)n1c2ccccc2c(=O)c2ccccc12
: