Target
Leukotriene A-4 hydrolase
Ligand
BDBM50425149
Substrate
Meas. Tech.
ChEMBL_936852 (CHEMBL2320734)
IC50
49±n/a nM
Citation
 Eccles, WBlevitt, JMBooker, JNChrovian, CCCrawford, Sde Leon, ARDeng, XFourie, AMGrice, CAHerman, KKarlsson, LKearney, AMLee-Dutra, ALiang, JLuna, RPippel, DRao, NRiley, JPSantillán, ASavall, BTanis, VMXue, XYoung, AL Identification of benzofuran central cores for the inhibition of leukotriene A(4) hydrolase. Bioorg Med Chem Lett 23:811-5 (2013)  
Target
Name:
Leukotriene A-4 hydrolase
Synonyms:
LKHA4_MOUSE Lta4h
Type:
PROTEIN
Mol. Mass.:
69048.58
Organism:
Mus musculus
Description:
ChEMBL_936852
Residue:
611
  
Inhibitor
Name:
BDBM50425149
Synonyms:
CHEMBL2313565
Type:
Small organic molecule
Emp. Form.:
C19H17N3O3S
Mol. Mass.:
367.422
SMILES:
C(N1CCOCC1)c1coc2cc(Oc3nc4ncccc4s3)ccc12
: