Target
Sodium-dependent serotonin transporter
Ligand
BDBM50110577
Substrate
Meas. Tech.
ChEMBL_937749 (CHEMBL2318003)
Ki
0.010000±n/a nM
Citation
 Zheng, PLieberman, BPPloessl, KLemoine, LMiller, SKung, HF A new single-photon emission computed tomography (SPECT) imaging agent for serotonin transporters: [(125)I]Flip-IDAM, (2-((2-((dimethylamino)methyl)-4-iodophenyl)thio)phenyl)methanol. Bioorg Med Chem Lett 23:869-72 (2013)  
Target
Name:
Sodium-dependent serotonin transporter
Synonyms:
5-HT Transporter 5HTT SC6A4_HUMAN SLC6A4 Serotonin transporter (5HTT) Sodium-dependent serotonin transporter (SERT) | Solute carrier family 6 member 4
Type:
Multi-pass membrane protein
Mol. Mass.:
70322.51
Organism:
Homo sapiens (Human)
Description:
P31645
Residue:
630
  
Inhibitor
Name:
BDBM50110577
Synonyms:
2-(2-((dimethylamino)methyl)phenylthio)-5-iodoaniline CHEMBL23034 | CHEMBL2314218
Type:
Small organic molecule
Emp. Form.:
C15H17IN2S
Mol. Mass.:
384.278
SMILES:
CN(C)Cc1ccccc1Sc1ccc(I)cc1N
: