Target
Histone-lysine N-methyltransferase EHMT2
Ligand
BDBM50425310
Substrate
Meas. Tech.
ChEMBL_933812 (CHEMBL2321366)
IC50
27100±n/a nM
Citation
 Fujishiro, SDodo, KIwasa, ETeng, YSohtome, YHamashima, YIto, AYoshida, MSodeoka, M Epidithiodiketopiperazine as a pharmacophore for protein lysine methyltransferase G9a inhibitors: reducing cytotoxicity by structural simplification. Bioorg Med Chem Lett 23:733-6 (2013)  
Target
Name:
Histone-lysine N-methyltransferase EHMT2
Synonyms:
BAT8 EHMT2 G9A Histone-lysine N-methyltransferase EHMT1/EHMT2 KMT1C Protein G9a (G9a)
Type:
Enzyme
Mol. Mass.:
132339.87
Organism:
Homo sapiens (Human)
Description:
Q96KQ7
Residue:
1210
  
Inhibitor
Name:
BDBM50425310
Synonyms:
CHEMBL2315525
Type:
Small organic molecule
Emp. Form.:
C30H32N6O6S4
Mol. Mass.:
700.872
SMILES:
CN1C(=O)[C@@]2(S)C[C@]3([C@H](Nc4ccccc34)N2C(=O)[C@@]1(S)CO)[C@]12C[C@@]3(S)N([C@H]1Nc1ccccc21)C(=O)[C@@](S)(CO)N(C)C3=O
: