Target
Thyroid hormone receptor beta
Ligand
BDBM50425400
Substrate
Meas. Tech.
ChEMBL_935146 (CHEMBL2317308)
Ki
12±n/a nM
Citation
 Shiohara, HNakamura, TKikuchi, NOzawa, TMatsuzawa, ANagano, ROhnota, HMiyamoto, TIchikawa, KHashizume, K Design, synthesis, and structure-activity relationship (SAR) of N-[7-(4-hydroxyphenoxy)-6-methylindan-4-yl]malonamic acids as thyroid hormone receptorß (TRß) selective agonists. Bioorg Med Chem 21:592-607 (2013)  
Target
Name:
Thyroid hormone receptor beta
Synonyms:
ERBA2 Nuclear receptor subfamily 1 group A member 2 THR1 c-erbA-2 | c-erbA-beta
Type:
Receptor
Mol. Mass.:
52793.62
Organism:
Homo sapiens (Human)
Description:
Recombinant hThR was obtained from nuclear extracts from SF9 cells infected with baculovirus vectors encoding for ThRbeta 1.
Residue:
461
  
Inhibitor
Name:
BDBM50425400
Synonyms:
CHEMBL2312268
Type:
Small organic molecule
Emp. Form.:
C27H25F2NO5
Mol. Mass.:
481.4879
SMILES:
Cc1cc(NC(=O)CC(O)=O)c2CCCc2c1Oc1ccc(O)c(CCc2ccc(F)cc2F)c1
: