Target
Muscarinic acetylcholine receptor M1
Ligand
BDBM50111346
Substrate
Meas. Tech.
ChEMBL_936429 (CHEMBL2317638)
Ki
653±n/a nM
Citation
 Zheng, GSmith, AMHuang, XSubramanian, KLSiripurapu, KBDeaciuc, AZhan, CGDwoskin, LP Structural modifications to tetrahydropyridine-3-carboxylate esters en route to the discovery of M5-preferring muscarinic receptor orthosteric antagonists. J Med Chem 56:1693-703 (2013)  
Target
Name:
Muscarinic acetylcholine receptor M1
Synonyms:
ACM1_HUMAN Cholinergic receptor, muscarinic 1 | Cholinergic, muscarinic M1
Type:
Protein
Mol. Mass.:
51442.54
Organism:
Homo sapiens (Human)
Description:
P11229
Residue:
460
  
Inhibitor
Name:
BDBM50111346
Synonyms:
(2-Amino-3-methyl-phenyl)-{4-[4-(3-chloro-benzenesulfonyl)-benzyl]-[1,4']bipiperidinyl-1'-yl}-methanone SCH-211803
Type:
Small organic molecule
Emp. Form.:
C31H36ClN3O3S
Mol. Mass.:
566.154
SMILES:
Cc1cccc(C(=O)N2CCC(CC2)N2CCC(Cc3ccc(cc3)S(=O)(=O)c3cccc(Cl)c3)CC2)c1N
: