Target
Acetyl-CoA carboxylase 2
Ligand
BDBM50426523
Substrate
Meas. Tech.
ChEMBL_938402 (CHEMBL2329345)
IC50
2.1±n/a nM
Citation
 Abdel-Magid, AF Treatment of Obesity and Related Disorders with Acetyl-CoA Carboxylase Inhibitors. ACS Med Chem Lett 4:16-7 (2013)  
Target
Name:
Acetyl-CoA carboxylase 2
Synonyms:
ACACB ACC-beta ACCB Acetyl-CoA carboxylase 2 Acetyl-CoA carboxylase 2 (ACC2)
Type:
Protein
Mol. Mass.:
276535.21
Organism:
Homo sapiens (Human)
Description:
O00763
Residue:
2458
  
Inhibitor
Name:
BDBM50426523
Synonyms:
CHEMBL2323628
Type:
Small organic molecule
Emp. Form.:
C25H28N4O3
Mol. Mass.:
432.5148
SMILES:
COc1ccc2ncc(cc2c1)C(=O)N1CCC2(CC1)Cc1cnn(C(C)C)c1C(=O)C2
: