Target
D(2) dopamine receptor
Ligand
BDBM50122815
Substrate
Meas. Tech.
ChEMBL_939353 (CHEMBL2327488)
Ki
140±n/a nM
Citation
 Jørgensen, MJørgensen, PNChristoffersen, CTJensen, KGBalle, TBang-Andersen, B Discovery of novela1-adrenoceptor ligands based on the antipsychotic sertindole suitable for labeling as PET ligands. Bioorg Med Chem 21:196-204 (2012)  
Target
Name:
D(2) dopamine receptor
Synonyms:
D(2) dopamine receptor DOPAMINE D2 Long DRD2 Dopamine D2 receptor Dopamine D2 receptor (D2R) Dopamine2-like | d2
Type:
Cell-surface receptors
Mol. Mass.:
50647.10
Organism:
Homo sapiens (Human)
Description:
P14416
Residue:
443
  
Inhibitor
Name:
BDBM50122815
Synonyms:
1-(2-{4-[1-(4-Fluoro-phenyl)-5-(2-methyl-2H-tetrazol-5-yl)-1H-indol-3-yl]-piperidin-1-yl}-ethyl)-imidazolidin-2-one | CHEMBL319352
Type:
Small organic molecule
Emp. Form.:
C26H29FN8O
Mol. Mass.:
488.5599
SMILES:
Cn1nnc(n1)-c1ccc2n(cc(C3CCN(CCN4CCNC4=O)CC3)c2c1)-c1ccc(F)cc1
: