Target
D(2) dopamine receptor
Ligand
BDBM50241119
Substrate
Meas. Tech.
ChEMBL_939640 (CHEMBL2328744)
IC50
2.9±n/a nM
Citation
 Urbanek, RAXiong, HWu, YBlackwell, WSteelman, GRosamond, JWesolowski, SSCampbell, JBZhang, MBrockel, BWidzowski, DV Synthesis and SAR of aminothiazole fused benzazepines as selective dopamine D2 partial agonists. Bioorg Med Chem Lett 23:543-7 (2012)  
Target
Name:
D(2) dopamine receptor
Synonyms:
D(2) dopamine receptor DOPAMINE D2 Long DRD2 Dopamine D2 receptor Dopamine D2 receptor (D2R) Dopamine2-like | d2
Type:
Cell-surface receptors
Mol. Mass.:
50647.10
Organism:
Homo sapiens (Human)
Description:
P14416
Residue:
443
  
Inhibitor
Name:
BDBM50241119
Synonyms:
7-(4-Biphenyl-3-ylmethyl-piperazin-1-yl)-3H-benzooxazol-2-one CHEMBL218166
Type:
Small organic molecule
Emp. Form.:
C24H23N3O2
Mol. Mass.:
385.4583
SMILES:
O=c1[nH]c2cccc(N3CCN(Cc4cccc(c4)-c4ccccc4)CC3)c2o1
: