Target
Carbonic anhydrase 9
Ligand
BDBM50426699
Substrate
Meas. Tech.
ChEMBL_939843 (CHEMBL2329436)
Ki
58±n/a nM
Citation
 Tars, KVullo, DKazaks, ALeitans, JLends, AGrandane, AZalubovskis, RScozzafava, ASupuran, CT Sulfocoumarins (1,2-benzoxathiine-2,2-dioxides): a class of potent and isoform-selective inhibitors of tumor-associated carbonic anhydrases. J Med Chem 56:293-300 (2013)  
Target
Name:
Carbonic anhydrase 9
Synonyms:
CA-IX CAH9_HUMAN Carbonic anhydrase 9 (CA IX) Carbonic anhydrase 9 precursor Carbonic anhydrase IX (CAIX) Carbonic anhydrases; II & IX MN RCC-associated antigen G250
Type:
Enzyme
Mol. Mass.:
49669.03
Organism:
Homo sapiens (Human)
Description:
Catalytic domain of human cloned isozyme was used in the assay
Residue:
459
  
Inhibitor
Name:
BDBM50426699
Synonyms:
CHEMBL2326517
Type:
Small organic molecule
Emp. Form.:
C11H9N3O4S
Mol. Mass.:
279.272
SMILES:
OCc1cn(nn1)-c1ccc2OS(=O)(=O)C=Cc2c1
: