Target
Carbonic anhydrase 1
Ligand
BDBM50426700
Substrate
Meas. Tech.
ChEMBL_939845 (CHEMBL2329438)
Ki
6000±n/a nM
Citation
 Tars, KVullo, DKazaks, ALeitans, JLends, AGrandane, AZalubovskis, RScozzafava, ASupuran, CT Sulfocoumarins (1,2-benzoxathiine-2,2-dioxides): a class of potent and isoform-selective inhibitors of tumor-associated carbonic anhydrases. J Med Chem 56:293-300 (2013)  
Target
Name:
Carbonic anhydrase 1
Synonyms:
CA-I CAB Carbonate dehydratase I Carbonic anhydrase 1 (CA I) Carbonic anhydrase 1 (Recombinant CA I) Carbonic anhydrase B Carbonic anhydrase I (CA I) Carbonic anhydrase I (CAI) Carbonic anhydrase isoenzyme I (hCA I) | hCA
Type:
Enzyme
Mol. Mass.:
28873.37
Organism:
Homo sapiens (Human)
Description:
P00915
Residue:
261
  
Inhibitor
Name:
BDBM50426700
Synonyms:
CHEMBL2326516
Type:
Small organic molecule
Emp. Form.:
C13H15N3O3SSi
Mol. Mass.:
321.427
SMILES:
C[Si](C)(C)c1cn(nn1)-c1ccc2OS(=O)(=O)C=Cc2c1
: