Target
NEDD8-activating enzyme E1 regulatory subunit
Ligand
BDBM50427032
Substrate
Meas. Tech.
ChEMBL_939690 (CHEMBL2328915)
IC50
5000±n/a nM
Citation
 da Silva, SRPaiva, SLLukkarila, JLGunning, PT Exploring a new frontier in cancer treatment: targeting the ubiquitin and ubiquitin-like activating enzymes. J Med Chem 56:2165-77 (2013)  
Target
Name:
NEDD8-activating enzyme E1 regulatory subunit
Synonyms:
APP-BP1 Amyloid beta precursor protein-binding protein 1, 59 kDa NAE1 ULA1_HUMAN
Type:
PROTEIN
Mol. Mass.:
60233.54
Organism:
Homo sapiens (Human)
Description:
ChEMBL_939705
Residue:
534
  
Inhibitor
Name:
BDBM50427032
Synonyms:
6,6''-Biapigenin | CHEMBL2322196
Type:
Small organic molecule
Emp. Form.:
C30H18O10
Mol. Mass.:
538.4579
SMILES:
Oc1ccc(cc1)-c1cc(O)c2c(cc(O)c(-c3c(O)cc4oc(cc(=O)c4c3O)-c3ccc(O)cc3)c2=O)o1
: