Target
Carbonic anhydrase 2
Ligand
BDBM29278
Substrate
Meas. Tech.
ChEMBL_938522 (CHEMBL2327206)
Ki
5959±n/a nM
Citation
 Pan, PVermelho, ABCapaci Rodrigues, GScozzafava, ATolvanen, MEParkkila, SCapasso, CSupuran, CT Cloning, characterization, and sulfonamide and thiol inhibition studies of ana-carbonic anhydrase from Trypanosoma cruzi, the causative agent of Chagas disease. J Med Chem 56:1761-71 (2013)  
Target
Name:
Carbonic anhydrase 2
Synonyms:
CA-II CAC Carbonate dehydratase II Carbonic anhydrase 2 (CA-II) Carbonic anhydrase C Carbonic anhydrase II (CA-II) Carbonic anhydrase II (hCA II) | Carbonic anhydrase isoenzyme II (hCA II)
Type:
Enzyme
Mol. Mass.:
29250.71
Organism:
Homo sapiens (Human)
Description:
P00918
Residue:
260
  
Inhibitor
Name:
BDBM29278
Synonyms:
CHEMBL310671 SAC Saccharin
Type:
Small organic molecule
Emp. Form.:
C7H5NO3S
Mol. Mass.:
183.185
SMILES:
O=C1NS(=O)(=O)c2ccccc12
: