Target
Kinesin-like protein KIF11
Ligand
BDBM50427271
Substrate
Meas. Tech.
ChEMBL_940910 (CHEMBL2330556)
Ki
12±n/a nM
Citation
 Good, JAWang, FRath, OKaan, HYTalapatra, SKPodgórski, DMacKay, SPKozielski, F Optimized S-trityl-L-cysteine-based inhibitors of kinesin spindle protein with potent in vivo antitumor activity in lung cancer xenograft models. J Med Chem 56:1878-93 (2013)  
Target
Name:
Kinesin-like protein KIF11
Synonyms:
EG5 KIF11_HUMAN Kinesin Spindle Protein Eg5 TRIP5 | kinesin spindle protein
Type:
PROTEIN
Mol. Mass.:
119138.97
Organism:
Homo sapiens (Human)
Description:
ChEMBL_1457426
Residue:
1056
  
Inhibitor
Name:
BDBM50427271
Synonyms:
CHEMBL2325407
Type:
Small organic molecule
Emp. Form.:
C22H22FNOS
Mol. Mass.:
367.48
SMILES:
COc1ccc(c(F)c1)C(SCCN)(c1ccccc1)c1ccccc1
: