Target
Kinesin-like protein KIF11
Ligand
BDBM50382559
Substrate
Meas. Tech.
ChEMBL_938549 (CHEMBL2327388)
Ki
2.3±n/a nM
Citation
 Good, JAWang, FRath, OKaan, HYTalapatra, SKPodgórski, DMacKay, SPKozielski, F Optimized S-trityl-L-cysteine-based inhibitors of kinesin spindle protein with potent in vivo antitumor activity in lung cancer xenograft models. J Med Chem 56:1878-93 (2013)  
Target
Name:
Kinesin-like protein KIF11
Synonyms:
EG5 KIF11_HUMAN Kinesin Spindle Protein Eg5 TRIP5 | kinesin spindle protein
Type:
PROTEIN
Mol. Mass.:
119138.97
Organism:
Homo sapiens (Human)
Description:
ChEMBL_1457426
Residue:
1056
  
Inhibitor
Name:
BDBM50382559
Synonyms:
ISPINESIB
Type:
Small organic molecule
Emp. Form.:
C30H33ClN4O2
Mol. Mass.:
517.062
SMILES:
CC(C)[C@@H](N(CCCN)C(=O)c1ccc(C)cc1)c1nc2cc(Cl)ccc2c(=O)n1Cc1ccccc1
: