Target
Protein kinase C alpha type
Ligand
BDBM50427369
Substrate
Meas. Tech.
ChEMBL_941117 (CHEMBL2330914)
Ki
1240±n/a nM
Citation
 Jimenez, JMBoyall, DBrenchley, GCollier, PNDavis, CJFraysse, DKeily, SBHenderson, JMiller, APierard, FSettimo, LTwin, HCBolton, CMCurnock, APChiu, PTanner, AJYoung, S Design and optimization of selective protein kinase C¿ (PKC¿) inhibitors for the treatment of autoimmune diseases. J Med Chem 56:1799-810 (2013)  
Target
Name:
Protein kinase C alpha type
Synonyms:
KPCA_HUMAN PKC alpha and beta-2 PKC-alpha PRKACA Protein Kinase C- alpha Protein kinase C alpha (PKCa) Protein kinase C alpha type (PRKCA) RAF proto-oncogene serine/threonine-protein kinase
Type:
Enzyme
Mol. Mass.:
76755.65
Organism:
Homo sapiens (Human)
Description:
The recombinant human PKC enzymes were produced using a baculovirus expression system in SF9 cells
Residue:
672
  
Inhibitor
Name:
BDBM50427369
Synonyms:
CHEMBL2326012
Type:
Small organic molecule
Emp. Form.:
C20H25ClN6O
Mol. Mass.:
400.905
SMILES:
CC(C)[C@@](C)(O)[C@@H]1CN(CCN1)c1ccc(Cl)c(n1)-c1n[nH]c2ncccc12
: