Target
Protein kinase C epsilon type
Ligand
BDBM50427363
Substrate
Meas. Tech.
ChEMBL_941100 (CHEMBL2330897)
Ki
1.000000±n/a nM
Citation
 Jimenez, JMBoyall, DBrenchley, GCollier, PNDavis, CJFraysse, DKeily, SBHenderson, JMiller, APierard, FSettimo, LTwin, HCBolton, CMCurnock, APChiu, PTanner, AJYoung, S Design and optimization of selective protein kinase C¿ (PKC¿) inhibitors for the treatment of autoimmune diseases. J Med Chem 56:1799-810 (2013)  
Target
Name:
Protein kinase C epsilon type
Synonyms:
KPCE_HUMAN PKCE Protein kinase C epsilon Protein kinase C, PKC; classical/novel nPKC-epsilon
Type:
Enzyme
Mol. Mass.:
83680.45
Organism:
Homo sapiens (Human)
Description:
The recombinant human PKC enzymes were produced using a baculovirus expression system in SF9 cells
Residue:
737
  
Inhibitor
Name:
BDBM50427363
Synonyms:
CHEMBL2326002
Type:
Small organic molecule
Emp. Form.:
C20H24ClFN6O
Mol. Mass.:
418.896
SMILES:
CC(C)[C@@](C)(O)[C@@H]1CN(CCN1)c1nc(-c2n[nH]c3ncccc23)c(F)cc1Cl
: