Target
Adenosine receptor A3
Ligand
BDBM50427594
Substrate
Meas. Tech.
ChEMBL_941721 (CHEMBL2330944)
Ki
5.2±n/a nM
Citation
 Squarcialupi, LColotta, VCatarzi, DVarano, FFilacchioni, GVarani, KCorciulo, CVincenzi, FBorea, PAGhelardini, CDi Cesare Mannelli, LCiancetta, AMoro, S 2-Arylpyrazolo[4,3-d]pyrimidin-7-amino derivatives as new potent and selective human A3 adenosine receptor antagonists. Molecular modeling studies and pharmacological evaluation. J Med Chem 56:2256-69 (2013)  
Target
Name:
Adenosine receptor A3
Synonyms:
A3 adenosine receptor (hA3) ADORA3 | Adenosine A3 receptor (A3AR)
Type:
G Protein-Coupled Receptor (GPCR)
Mol. Mass.:
36197.32
Organism:
Homo sapiens (Human)
Description:
P0DMS8
Residue:
318
  
Inhibitor
Name:
BDBM50427594
Synonyms:
CHEMBL2322928
Type:
Small organic molecule
Emp. Form.:
C18H14N6O
Mol. Mass.:
330.3434
SMILES:
Cc1nc(NC(=O)c2ccncc2)c2nn(cc2n1)-c1ccccc1
: