Target
Aldo-keto reductase family 1 member C4
Ligand
BDBM50427624
Substrate
Meas. Tech.
ChEMBL_941820 (CHEMBL2329811)
IC50
3150±n/a nM
Citation
 Liedtke, AJAdeniji, AOChen, MByrns, MCJin, YChristianson, DWMarnett, LJPenning, TM Development of potent and selective indomethacin analogues for the inhibition of AKR1C3 (Type 5 17ß-hydroxysteroid dehydrogenase/prostaglandin F synthase) in castrate-resistant prostate cancer. J Med Chem 56:2429-46 (2013)  
Target
Name:
Aldo-keto reductase family 1 member C4
Synonyms:
3-alpha-HSD1 3-alpha-hydroxysteroid dehydrogenase type I AKR1C4 Aldo-keto reductase family 1 member C4 (AK1C4) CHDR DD-4 Dihydrodiol dehydrogenase 4 | HAKRA
Type:
Enzyme
Mol. Mass.:
37068.40
Organism:
Homo sapiens (Human)
Description:
P17516
Residue:
323
  
Inhibitor
Name:
BDBM50427624
Synonyms:
CHEMBL2323522 | US9346803, Table 2, Compound 11: 9-(4-chlorobenzoyl)-6-methoxy-2,3,4,9-tetrahydro-1H-carbazole-3-carboxylic acid
Type:
Small organic molecule
Emp. Form.:
C21H18ClNO4
Mol. Mass.:
383.825
SMILES:
COc1ccc2n(C(=O)c3ccc(Cl)cc3)c3CCC(Cc3c2c1)C(O)=O
: