Target
Protein arginine N-methyltransferase 3 [N508S]
Ligand
BDBM50427773
Substrate
Meas. Tech.
ChEMBL_941988 (CHEMBL2330282)
IC50
>25000±n/a nM
Citation
 Liu, FLi, FMa, ADobrovetsky, EDong, AGao, CKorboukh, ILiu, JSmil, DBrown, PJFrye, SVArrowsmith, CHSchapira, MVedadi, MJin, J Exploiting an allosteric binding site of PRMT3 yields potent and selective inhibitors. J Med Chem 56:2110-24 (2013)  
Target
Name:
Protein arginine N-methyltransferase 3 [N508S]
Synonyms:
ANM3_HUMAN Heterogeneous nuclear ribonucleoprotein methyltransferase-like protein 3 Protein arginine N-methyltransferase 3 | Protein arginine N-methyltransferase 3 (PRMT3)
Type:
Protein
Mol. Mass.:
59859.85
Organism:
Homo sapiens (Human)
Description:
O60678[N508S]
Residue:
531
  
Inhibitor
Name:
BDBM50427773
Synonyms:
CHEMBL2325182
Type:
Small organic molecule
Emp. Form.:
C15H11F3N4OS
Mol. Mass.:
352.334
SMILES:
FC(F)(F)c1ccccc1CNC(=O)Nc1ccc2nnsc2c1
: