Target
Protein arginine N-methyltransferase 3 [N508S]
Ligand
BDBM50427798
Substrate
Meas. Tech.
ChEMBL_941988 (CHEMBL2330282)
IC50
>10000±n/a nM
Citation
 Liu, FLi, FMa, ADobrovetsky, EDong, AGao, CKorboukh, ILiu, JSmil, DBrown, PJFrye, SVArrowsmith, CHSchapira, MVedadi, MJin, J Exploiting an allosteric binding site of PRMT3 yields potent and selective inhibitors. J Med Chem 56:2110-24 (2013)  
Target
Name:
Protein arginine N-methyltransferase 3 [N508S]
Synonyms:
ANM3_HUMAN Heterogeneous nuclear ribonucleoprotein methyltransferase-like protein 3 Protein arginine N-methyltransferase 3 | Protein arginine N-methyltransferase 3 (PRMT3)
Type:
Protein
Mol. Mass.:
59859.85
Organism:
Homo sapiens (Human)
Description:
O60678[N508S]
Residue:
531
  
Inhibitor
Name:
BDBM50427798
Synonyms:
CHEMBL2325187
Type:
Small organic molecule
Emp. Form.:
C15H21N5OS
Mol. Mass.:
319.425
SMILES:
N[C@H]1CC[C@H](CCNC(=O)Nc2ccc3nnsc3c2)CC1
: