Target
Carbonic anhydrase 9
Ligand
BDBM50428422
Substrate
Meas. Tech.
ChEMBL_942128 (CHEMBL2341284)
Ki
670±n/a nM
Citation
 Davis, RAVullo, DMaresca, ASupuran, CTPoulsen, SA Natural product coumarins that inhibit human carbonic anhydrases. Bioorg Med Chem 21:1539-43 (2013)  
Target
Name:
Carbonic anhydrase 9
Synonyms:
CA-IX CAH9_HUMAN Carbonic anhydrase 9 (CA IX) Carbonic anhydrase 9 precursor Carbonic anhydrase IX (CAIX) Carbonic anhydrases; II & IX MN RCC-associated antigen G250
Type:
Enzyme
Mol. Mass.:
49669.03
Organism:
Homo sapiens (Human)
Description:
Catalytic domain of human cloned isozyme was used in the assay
Residue:
459
  
Inhibitor
Name:
BDBM50428422
Synonyms:
CHEMBL2334352
Type:
Small organic molecule
Emp. Form.:
C21H19NO5
Mol. Mass.:
365.3793
SMILES:
COc1ccc2ccc(=O)oc2c1C(COC(=O)c1cccnc1)C(C)=C
: