Target
Carbonic anhydrase 2
Ligand
BDBM12414
Substrate
Meas. Tech.
ChEMBL_942133 (CHEMBL2341289)
Ki
5870±n/a nM
Citation
 Demirdag, RÇomakli, VSentürk, MEkinci, DIrfan Küfrevioglu, ÖSupuran, CT Purification and characterization of carbonic anhydrase from sheep kidney and effects of sulfonamides on enzyme activity. Bioorg Med Chem 21:1522-5 (2013)  
Target
Name:
Carbonic anhydrase 2
Synonyms:
CA-II CAC Carbonate dehydratase II Carbonic anhydrase 2 (CA-II) Carbonic anhydrase C Carbonic anhydrase II (CA-II) Carbonic anhydrase II (hCA II) | Carbonic anhydrase isoenzyme II (hCA II)
Type:
Enzyme
Mol. Mass.:
29250.71
Organism:
Homo sapiens (Human)
Description:
P00918
Residue:
260
  
Inhibitor
Name:
BDBM12414
Synonyms:
CHEMBL27601 hCA inhibitor, 6
Type:
Small organic molecule
Emp. Form.:
C6H7NO2S
Mol. Mass.:
157.19
SMILES:
NS(=O)(=O)c1ccccc1
: