Target
Induced myeloid leukemia cell differentiation protein Mcl-1
Ligand
BDBM50428733
Substrate
Meas. Tech.
ChEMBL_947456 (CHEMBL2345532)
Kd
1060±n/a nM
Citation
 Zhang, ZSong, TLi, XWu, ZFeng, YXie, FLiu, CQin, JChen, H Novel soluble myeloid cell leukemia sequence 1 (Mcl-1) inhibitor (E,E)-2-(benzylaminocarbonyl)-3-styrylacrylonitrile (4g) developed using a fragment-based approach. Eur J Med Chem 59:141-9 (2013)  
Target
Name:
Induced myeloid leukemia cell differentiation protein Mcl-1
Synonyms:
BCL2L3 Bcl-2-like protein 3 (Mcl-1) Bcl2-L-3 MCL1 Mcl-1 Myeloid cell leukemia sequence 1 (BCL2-related) | mcl1/EAT
Type:
Membrane; Single-pass membrane protein
Mol. Mass.:
37332.87
Organism:
Homo sapiens (Human)
Description:
Q07820
Residue:
350
  
Inhibitor
Name:
BDBM50428733
Synonyms:
CHEMBL2333143
Type:
Small organic molecule
Emp. Form.:
C12H10N2O
Mol. Mass.:
198.2206
SMILES:
NC(=O)C(=C\C=C\c1ccccc1)\C#N
: