Target
UDP-N-acetylglucosamine 1-carboxyvinyltransferase
Ligand
BDBM50024894
Substrate
Meas. Tech.
ChEMBL_949339 (CHEMBL2339337)
IC50
100±n/a nM
Citation
 Scholz, THeyl, CLBernardi, DZimmermann, SKattner, LKlein, CD Chemical, biochemical and microbiological properties of a brominated nitrovinylfuran with broad-spectrum antibacterial activity. Bioorg Med Chem 21:795-804 (2013)  
Target
Name:
UDP-N-acetylglucosamine 1-carboxyvinyltransferase
Synonyms:
EPT MURA_ECOLI UDP-N-acetylglucosamine 1-carboxyvinyltransferase murA | murZ
Type:
Protein
Mol. Mass.:
44814.62
Organism:
Escherichia coli K-12 (Enterobacteria)
Description:
E. coli MurA
Residue:
419
  
Inhibitor
Name:
BDBM50024894
Synonyms:
(1R, 2S)-1,2-epoxypropyl-phosphonic acid (2R,3S)-3-methyloxiran-2-ylphosphonic acid CHEMBL1757 Fosfomycin (compound 1) Fosfomycin Sodium phosphomycin
Type:
Small organic molecule
Emp. Form.:
C3H7O4P
Mol. Mass.:
138.059
SMILES:
C[C@@H]1O[C@@H]1P(O)(O)=O
: