Target
UDP-N-acetylglucosamine 1-carboxyvinyltransferase
Ligand
BDBM50428795
Substrate
Meas. Tech.
ChEMBL_949339 (CHEMBL2339337)
IC50
2800±n/a nM
Citation
 Scholz, THeyl, CLBernardi, DZimmermann, SKattner, LKlein, CD Chemical, biochemical and microbiological properties of a brominated nitrovinylfuran with broad-spectrum antibacterial activity. Bioorg Med Chem 21:795-804 (2013)  
Target
Name:
UDP-N-acetylglucosamine 1-carboxyvinyltransferase
Synonyms:
EPT MURA_ECOLI UDP-N-acetylglucosamine 1-carboxyvinyltransferase murA | murZ
Type:
Protein
Mol. Mass.:
44814.62
Organism:
Escherichia coli K-12 (Enterobacteria)
Description:
E. coli MurA
Residue:
419
  
Inhibitor
Name:
BDBM50428795
Synonyms:
CHEMBL2335230 | MurA inhibitor (compound 7)
Type:
Small organic molecule
Emp. Form.:
C6H3Br2NO3
Mol. Mass.:
296.901
SMILES:
[O-][N+](=O)C(\Br)=C\c1ccc(Br)o1
: