Target
NAD-dependent protein deacetylase sirtuin-1
Ligand
BDBM50428992
Substrate
Meas. Tech.
ChEMBL_948493 (CHEMBL2343194)
EC50
2300±n/a nM
Citation
 Wu, JZhang, DChen, LLi, JWang, JNing, CYu, NZhao, FChen, DChen, XChen, KJiang, HLiu, HLiu, D Discovery and mechanism study of SIRT1 activators that promote the deacetylation of fluorophore-labeled substrate. J Med Chem 56:761-80 (2013)  
Target
Name:
NAD-dependent protein deacetylase sirtuin-1
Synonyms:
NAD-Dependent Deacetylase Sirtuin-1 NAD-dependent protein deacetylase sirtuin-1 (SIRT1) SIR2-like protein 1 SIRT1 Sirtuin-1 (SIRT1) | hSIR2
Type:
Developmental protein; hydrolase
Mol. Mass.:
81626.66
Organism:
Homo sapiens (Human)
Description:
Residue:
747
  
Inhibitor
Name:
BDBM50428992
Synonyms:
CHEMBL2333662
Type:
Small organic molecule
Emp. Form.:
C19H14Br2N2O5S
Mol. Mass.:
542.198
SMILES:
CS(=O)(=O)c1ccc2cc(ccc2c1)C(=O)N\N=C\c1cc(Br)c(O)c(Br)c1O
: