Target
Diacylglycerol O-acyltransferase 2
Ligand
BDBM50429009
Substrate
Meas. Tech.
ChEMBL_948533 (CHEMBL2343706)
IC50
1300±n/a nM
Citation
 Ting, PCLee, JFZorn, NKim, HMAslanian, RGLin, MSmith, MWalker, SSCook, JVan Heek, MLachowicz, J Lead optimization of a pyridine-carboxamide series as DGAT-1 inhibitors. Bioorg Med Chem Lett 23:985-8 (2013)  
Target
Name:
Diacylglycerol O-acyltransferase 2
Synonyms:
ARAT DGAT2 Diacylglycerol O-acyltransferase 2 (DGAT2) Retinol O-fatty-acyltransferase
Type:
Multi-pass membrane protein
Mol. Mass.:
43848.90
Organism:
Homo sapiens (Human)
Description:
Q96PD7
Residue:
388
  
Inhibitor
Name:
BDBM50429009
Synonyms:
CHEMBL2334100
Type:
Small organic molecule
Emp. Form.:
C34H31N3O5
Mol. Mass.:
561.627
SMILES:
Cc1c(oc2ccc(cc12)-c1ccccc1)C(=O)Nc1ccc(nc1)N1CCC(COc2cccc(c2)C(O)=O)CC1
: