Target
Diacylglycerol O-acyltransferase 1
Ligand
BDBM50429009
Substrate
Meas. Tech.
ChEMBL_948536 (CHEMBL2343709)
IC50
52±n/a nM
Citation
 Ting, PCLee, JFZorn, NKim, HMAslanian, RGLin, MSmith, MWalker, SSCook, JVan Heek, MLachowicz, J Lead optimization of a pyridine-carboxamide series as DGAT-1 inhibitors. Bioorg Med Chem Lett 23:985-8 (2013)  
Target
Name:
Diacylglycerol O-acyltransferase 1
Synonyms:
ACAT-related gene product 1 Acyl coA-diacylglycerol acyl transferase 1 (DGAT1) DGAT1 Diacylglycerol Acyltransferase (DGAT1) Diacylglycerol O-acyltransferase 1 (DGAT1) | Diglyceride acyltransferase
Type:
Protein
Mol. Mass.:
55297.82
Organism:
Homo sapiens (Human)
Description:
O75907
Residue:
488
  
Inhibitor
Name:
BDBM50429009
Synonyms:
CHEMBL2334100
Type:
Small organic molecule
Emp. Form.:
C34H31N3O5
Mol. Mass.:
561.627
SMILES:
Cc1c(oc2ccc(cc12)-c1ccccc1)C(=O)Nc1ccc(nc1)N1CCC(COc2cccc(c2)C(O)=O)CC1
: