Target
Indoleamine 2,3-dioxygenase 1
Ligand
BDBM21973
Substrate
Meas. Tech.
ChEMBL_943579 (CHEMBL2343392)
Ki
30000±n/a nM
Citation
 Tanaka, MLi, XHikawa, HSuzuki, TTsutsumi, KSato, MTakikawa, OSuzuki, HYokoyama, Y Synthesis and biological evaluation of novel tryptoline derivatives as indoleamine 2,3-dioxygenase (IDO) inhibitors. Bioorg Med Chem 21:1159-65 (2013)  
Target
Name:
Indoleamine 2,3-dioxygenase 1
Synonyms:
I23O1_HUMAN IDO-1 INDO Indoleamine 2,3-dioxygenase | Indoleamine-pyrrole 2,3-dioxygenase
Type:
Enzyme
Mol. Mass.:
45330.80
Organism:
Homo sapiens (Human)
Description:
P14902
Residue:
403
  
Inhibitor
Name:
BDBM21973
Synonyms:
1-Methyltryptophan, 1 | 2-amino-3-(1-methyl-1H-indol-3-yl)propanoic acid
Type:
Small organic molecule
Emp. Form.:
C12H14N2O2
Mol. Mass.:
218.2518
SMILES:
Cn1cc(CC(N)C(O)=O)c2ccccc12
: