Target
Botulinum neurotoxin type A
Ligand
BDBM23274
Substrate
Meas. Tech.
ChEMBL_943587 (CHEMBL2343854)
Ki
300±n/a nM
Citation
 Šilhár, PSilvaggi, NRPellett, SCapková, KJohnson, EAAllen, KNJanda, KD Evaluation of adamantane hydroxamates as botulinum neurotoxin inhibitors: synthesis, crystallography, modeling, kinetic and cellular based studies. Bioorg Med Chem 21:1344-8 (2013)  
Target
Name:
Botulinum neurotoxin type A
Synonyms:
BXA1_CLOBO bonT | botA
Type:
PROTEIN
Mol. Mass.:
149450.01
Organism:
Clostridium botulinum
Description:
ChEMBL_1510137
Residue:
1296
  
Inhibitor
Name:
BDBM23274
Synonyms:
(2E)-3-(2,4-dichlorophenyl)-N-hydroxyprop-2-enamide BMCL176463 Compound 2 | Cinnamic hydroxamate deriv., 18
Type:
Small organic molecule
Emp. Form.:
C9H7Cl2NO2
Mol. Mass.:
232.063
SMILES:
ONC(=O)\C=C\c1ccc(Cl)cc1Cl
: