Target
Carbonic anhydrase 1
Ligand
BDBM50429222
Substrate
Meas. Tech.
ChEMBL_946166 (CHEMBL2344045)
Ki
7.2±n/a nM
Citation
 Güzel-Akdemir, ÖAkdemir, AIsik, SVullo, DSupuran, CT o-Benzenedisulfonimido-sulfonamides are potent inhibitors of the tumor-associated carbonic anhydrase isoforms CA IX and CA XII. Bioorg Med Chem 21:1386-91 (2013)  
Target
Name:
Carbonic anhydrase 1
Synonyms:
CA-I CAB Carbonate dehydratase I Carbonic anhydrase 1 (CA I) Carbonic anhydrase 1 (Recombinant CA I) Carbonic anhydrase B Carbonic anhydrase I (CA I) Carbonic anhydrase I (CAI) Carbonic anhydrase isoenzyme I (hCA I) | hCA
Type:
Enzyme
Mol. Mass.:
28873.37
Organism:
Homo sapiens (Human)
Description:
P00915
Residue:
261
  
Inhibitor
Name:
BDBM50429222
Synonyms:
CHEMBL2331569
Type:
Small organic molecule
Emp. Form.:
C14H14N2O6S3
Mol. Mass.:
402.466
SMILES:
NS(=O)(=O)c1ccc(CCN2S(=O)(=O)c3ccccc3S2(=O)=O)cc1
: