Target
Aldo-keto reductase family 1 member C1
Ligand
BDBM50429337
Substrate
Meas. Tech.
ChEMBL_948089 (CHEMBL2345595)
IC50
7900±n/a nM
Citation
 Gazvoda, MBeranic, NTurk, SBurja, BKocevar, MRižner, TLGobec, SPolanc, S 2,3-diarylpropenoic acids as selective non-steroidal inhibitors of type-5 17ß-hydroxysteroid dehydrogenase (AKR1C3). Eur J Med Chem 62:89-97 (2013)  
Target
Name:
Aldo-keto reductase family 1 member C1
Synonyms:
20-alpha-HSD AK1C1_HUMAN Aldo-keto reductase family 1 member C1 (AK1C1) Aldo-keto reductase family 1 member C1 (AKR1C1) DDH High-affinity hepatic bile acid-binding protein | Trans-1,2-dihydrobenzene-1,2-diol dehydrogenase
Type:
Enzyme
Mol. Mass.:
36793.97
Organism:
Homo sapiens (Human)
Description:
Recombinant AKR1C1 enzyme was expressed in E. coli.
Residue:
323
  
Inhibitor
Name:
BDBM50429337
Synonyms:
(E)-2,3-Diphenylacrylic Acid | CHEMBL1980291
Type:
Small organic molecule
Emp. Form.:
C15H12O2
Mol. Mass.:
224.2546
SMILES:
OC(=O)C(=C\c1ccccc1)\c1ccccc1
: