Target
Beta-galactosidase
Ligand
BDBM50358321
Substrate
Meas. Tech.
ChEMBL_943698 (CHEMBL2344842)
Ki
300±n/a nM
Citation
 Boyd, RELee, GRybczynski, PBenjamin, ERKhanna, RWustman, BAValenzano, KJ Pharmacological chaperones as therapeutics for lysosomal storage diseases. J Med Chem 56:2705-25 (2013)  
Target
Name:
Beta-galactosidase
Synonyms:
Acid beta-galactosidase ELNR1 GLB1 | Lactase
Type:
PROTEIN
Mol. Mass.:
76074.43
Organism:
Homo sapiens (Human)
Description:
ChEMBL_215886
Residue:
677
  
Inhibitor
Name:
BDBM50358321
Synonyms:
CHEMBL1922579 | CHEMBL1922581
Type:
Small organic molecule
Emp. Form.:
C15H29NO4
Mol. Mass.:
287.3951
SMILES:
CCCCCCCCN[C@@H]1C=C(CO)[C@H](O)[C@H](O)[C@H]1O
: