Target
Dihydrofolate reductase
Ligand
BDBM26519
Substrate
Meas. Tech.
ChEMBL_947633 (CHEMBL2340620)
IC50
100±n/a nM
Citation
 Paulsen, JLViswanathan, KWright, DLAnderson, AC Structural analysis of the active sites of dihydrofolate reductase from two species of Candida uncovers ligand-induced conformational changes shared among species. Bioorg Med Chem Lett 23:1279-84 (2013)  
Target
Name:
Dihydrofolate reductase
Synonyms:
DFR1 Dihydrofolate Reductase (DHFR) | Tetrahydrofolate dehydrogenase
Type:
Enzyme
Mol. Mass.:
22141.77
Organism:
Candida albicans
Description:
C. albicans DHFR was expressed in E. coli BL21, and purified to homogeneity.
Residue:
192
  
Inhibitor
Name:
BDBM26519
Synonyms:
5-[3-(2,5-dimethoxyphenyl)prop-1-yn-1-yl]-6-ethylpyrimidine-2,4-diamine Propargyl-linked, 11
Type:
Small organic molecule
Emp. Form.:
C17H20N4O2
Mol. Mass.:
312.3663
SMILES:
CCc1nc(N)nc(N)c1C#CCc1cc(OC)ccc1OC
: