Target
Fatty acid-binding protein, heart
Ligand
BDBM50429932
Substrate
Meas. Tech.
ChEMBL_945779 (CHEMBL2339126)
Kd
2170±n/a nM
Citation
 Beniyama, YMatsuno, KMiyachi, H Structure-guided design, synthesis and in vitro evaluation of a series of pyrazole-based fatty acid binding protein (FABP) 3 ligands. Bioorg Med Chem Lett 23:1662-6 (2013)  
Target
Name:
Fatty acid-binding protein, heart
Synonyms:
FABP11 FABPH_HUMAN MDGI
Type:
PROTEIN
Mol. Mass.:
14858.36
Organism:
Homo sapiens (Human)
Description:
ChEMBL_1463784
Residue:
133
  
Inhibitor
Name:
BDBM50429932
Synonyms:
CHEMBL2334256
Type:
Small organic molecule
Emp. Form.:
C25H21ClN2O3
Mol. Mass.:
432.899
SMILES:
OC(=O)CCCOc1ccccc1-c1cc(-c2ccccc2)n(n1)-c1ccc(Cl)cc1
: