Target
Fatty acid-binding protein, adipocyte
Ligand
BDBM50429942
Substrate
Meas. Tech.
ChEMBL_945781 (CHEMBL2339128)
IC50
10300±n/a nM
Citation
 Beniyama, YMatsuno, KMiyachi, H Structure-guided design, synthesis and in vitro evaluation of a series of pyrazole-based fatty acid binding protein (FABP) 3 ligands. Bioorg Med Chem Lett 23:1662-6 (2013)  
Target
Name:
Fatty acid-binding protein, adipocyte
Synonyms:
A-FABP ALBP FABP4 Fatty acid binding protein adipocyte Fatty acid-binding protein 4 (FABP4)
Type:
Enzyme
Mol. Mass.:
14719.23
Organism:
Homo sapiens (Human)
Description:
P15090
Residue:
132
  
Inhibitor
Name:
BDBM50429942
Synonyms:
CHEMBL2334257 | US10709688, Example 5
Type:
Small organic molecule
Emp. Form.:
C28H28N2O3
Mol. Mass.:
440.5335
SMILES:
CC(C)c1ccc(cc1)-n1nc(cc1-c1ccccc1)-c1ccccc1OCCCC(O)=O
: