Target
Fatty acid-binding protein, adipocyte
Ligand
BDBM50429934
Substrate
Meas. Tech.
ChEMBL_945781 (CHEMBL2339128)
IC50
10200±n/a nM
Citation
 Beniyama, YMatsuno, KMiyachi, H Structure-guided design, synthesis and in vitro evaluation of a series of pyrazole-based fatty acid binding protein (FABP) 3 ligands. Bioorg Med Chem Lett 23:1662-6 (2013)  
Target
Name:
Fatty acid-binding protein, adipocyte
Synonyms:
A-FABP ALBP FABP4 Fatty acid binding protein adipocyte Fatty acid-binding protein 4 (FABP4)
Type:
Enzyme
Mol. Mass.:
14719.23
Organism:
Homo sapiens (Human)
Description:
P15090
Residue:
132
  
Inhibitor
Name:
BDBM50429934
Synonyms:
CHEMBL2334254 | US10709688, Example 7
Type:
Small organic molecule
Emp. Form.:
C25H21FN2O3
Mol. Mass.:
416.4442
SMILES:
OC(=O)CCCOc1ccccc1-c1cc(-c2ccccc2)n(n1)-c1ccc(F)cc1
: