Target
Fatty acid-binding protein, heart
Ligand
BDBM50429948
Substrate
Meas. Tech.
ChEMBL_945782 (CHEMBL2339129)
IC50
>10000000±n/a nM
Citation
 Beniyama, YMatsuno, KMiyachi, H Structure-guided design, synthesis and in vitro evaluation of a series of pyrazole-based fatty acid binding protein (FABP) 3 ligands. Bioorg Med Chem Lett 23:1662-6 (2013)  
Target
Name:
Fatty acid-binding protein, heart
Synonyms:
FABP11 FABPH_HUMAN MDGI
Type:
PROTEIN
Mol. Mass.:
14858.36
Organism:
Homo sapiens (Human)
Description:
ChEMBL_1463784
Residue:
133
  
Inhibitor
Name:
BDBM50429948
Synonyms:
CHEMBL2334248
Type:
Small organic molecule
Emp. Form.:
C28H27ClN2O3
Mol. Mass.:
474.979
SMILES:
OC(=O)CCCCCCOc1ccccc1-c1cc(-c2ccc(Cl)cc2)n(n1)-c1ccccc1
: