Target
Lysophosphatidic acid receptor 6
Ligand
BDBM50430010
Substrate
Meas. Tech.
ChEMBL_946255 (CHEMBL2344993)
EC50
90±n/a nM
Citation
 Jiang, GInoue, AAoki, JPrestwich, GD Phosphorothioate analogs of sn-2 radyl lysophosphatidic acid (LPA): metabolically stabilized LPA receptor agonists. Bioorg Med Chem Lett 23:1865-9 (2013)  
Target
Name:
Lysophosphatidic acid receptor 6
Synonyms:
LPA receptor 6 LPAR6 Oleoyl-L-alpha-lysophosphatidic acid receptor P2Y purinoceptor 5 Purinergic receptor 5 | RB intron encoded G-protein coupled receptor
Type:
PROTEIN
Mol. Mass.:
39408.81
Organism:
Homo sapiens (Human)
Description:
ChEMBL_946255
Residue:
344
  
Inhibitor
Name:
BDBM50430010
Synonyms:
CHEMBL2335047
Type:
Small organic molecule
Emp. Form.:
C22H47O5PS
Mol. Mass.:
454.644
SMILES:
[C@@H](COP(O)(O)=S)OC
: