Target
Lysophosphatidic acid receptor 3
Ligand
BDBM50430013
Substrate
Meas. Tech.
ChEMBL_946258 (CHEMBL2344996)
EC50
580±n/a nM
Citation
 Jiang, GInoue, AAoki, JPrestwich, GD Phosphorothioate analogs of sn-2 radyl lysophosphatidic acid (LPA): metabolically stabilized LPA receptor agonists. Bioorg Med Chem Lett 23:1865-9 (2013)  
Target
Name:
Lysophosphatidic acid receptor 3
Synonyms:
EDG7 LPAR3 Lysophosphatidic acid receptor 1/3 Lysophosphatidic acid receptor Edg-7
Type:
Enzyme
Mol. Mass.:
40149.72
Organism:
Homo sapiens (Human)
Description:
Q9UBY5
Residue:
353
  
Inhibitor
Name:
BDBM50430013
Synonyms:
CHEMBL364797
Type:
Small organic molecule
Emp. Form.:
C19H39O7P
Mol. Mass.:
410.4825
SMILES:
CCCCCCCCCCCCCCCC(=O)OC[C@@H](O)COP(O)(O)=O
: