Target
Calcitonin gene-related peptide type 1 receptor
Ligand
BDBM50273292
Substrate
Meas. Tech.
ChEMBL_949161 (CHEMBL2344728)
Ki
0.012000±n/a nM
Citation
 Han, XCiviello, RLConway, CMCook, DADavis, CDDegnan, APJiang, XJMacci, RMathias, NRMoench, PPin, SSSchartman, RSignor, LJThalody, GTora, GWhiterock, VXu, CMacor, JEDubowchik, GM The synthesis and SAR of calcitonin gene-related peptide (CGRP) receptor antagonists derived from tyrosine surrogates. Part 2. Bioorg Med Chem Lett 23:1870-3 (2013)  
Target
Name:
Calcitonin gene-related peptide type 1 receptor
Synonyms:
Adrenomedullin receptor AM1; CALCRL/RAMP2 CALRL_HUMAN CGRP type 1 receptor mRNA Calcitonin gene-related peptide (CGRP) receptor Calcitonin receptor-like receptor Human CL receptor
Type:
Enzyme Catalytic Domain
Mol. Mass.:
52980.45
Organism:
Homo sapiens (Human)
Description:
Q16602
Residue:
461
  
Inhibitor
Name:
BDBM50273292
Synonyms:
(R)-N-(1-(1,4'-bipiperidin-1'-yl)-3-(7-methyl-1H-indazol-5-yl)-1-oxopropan-2-yl)-4-(2-oxo-1,2-dihydroquinazolin-3(4H)-yl)piperidine-1-carboxamide CHEMBL454791
Type:
Small organic molecule
Emp. Form.:
C35H46N8O3
Mol. Mass.:
626.7915
SMILES:
Cc1cc(C[C@@H](NC(=O)N2CCC(CC2)N2Cc3ccccc3NC2=O)C(=O)N2CCC(CC2)N2CCCCC2)cc2cn[nH]c12
: