Target
Calcitonin gene-related peptide type 1 receptor
Ligand
BDBM50273291
Substrate
Meas. Tech.
ChEMBL_949161 (CHEMBL2344728)
Ki
0.230000±n/a nM
Citation
 Han, XCiviello, RLConway, CMCook, DADavis, CDDegnan, APJiang, XJMacci, RMathias, NRMoench, PPin, SSSchartman, RSignor, LJThalody, GTora, GWhiterock, VXu, CMacor, JEDubowchik, GM The synthesis and SAR of calcitonin gene-related peptide (CGRP) receptor antagonists derived from tyrosine surrogates. Part 2. Bioorg Med Chem Lett 23:1870-3 (2013)  
Target
Name:
Calcitonin gene-related peptide type 1 receptor
Synonyms:
Adrenomedullin receptor AM1; CALCRL/RAMP2 CALRL_HUMAN CGRP type 1 receptor mRNA Calcitonin gene-related peptide (CGRP) receptor Calcitonin receptor-like receptor Human CL receptor
Type:
Enzyme Catalytic Domain
Mol. Mass.:
52980.45
Organism:
Homo sapiens (Human)
Description:
Q16602
Residue:
461
  
Inhibitor
Name:
BDBM50273291
Synonyms:
(R)-N-(1-(1,4'-bipiperidin-1'-yl)-3-(1H-indazol-5-yl)-1-oxopropan-2-yl)-4-(2-oxo-1,2-dihydroquinazolin-3(4H)-yl)piperidine-1-carboxamide | CHEMBL454751
Type:
Small organic molecule
Emp. Form.:
C34H44N8O3
Mol. Mass.:
612.765
SMILES:
O=C(N[C@H](Cc1ccc2[nH]ncc2c1)C(=O)N1CCC(CC1)N1CCCCC1)N1CCC(CC1)N1Cc2ccccc2NC1=O
: